{"text_format":"3","workbook":"xlsx","n_sheets":6,"sheets":["Partner adatok","Jármű vagy telephely adatok","Berendezés adatok","Listák","Kitöltési útmutató","Eq_par"],"not_rendered":{"images":1,"external_links":1,"defined_names":26,"comments":3},"read":"whole","date_system":"1900"}

{"sheet":"Partner adatok","index":0,"n_rows":57,"n_cols":4,"rows_kept":57,"merged":[[0,1,0,3],[2,0,15,0],[3,2,3,3],[4,2,4,3],[5,2,5,3],[6,2,6,3],[7,2,7,3],[8,2,8,3],[9,2,9,3],[10,2,10,3],[11,2,11,3],[12,2,12,3],[13,2,13,3],[14,2,14,3],[15,2,15,3],[16,0,29,0],[18,2,18,3],[19,2,19,3],[20,2,20,3],[21,2,21,3],[22,2,22,3],[23,2,23,3],[24,2,24,3],[25,2,25,3],[26,2,26,3],[27,2,27,3],[28,2,28,3],[29,2,29,3],[30,0,36,0],[32,2,32,3],[33,2,33,3],[34,2,34,3],[35,2,35,3],[36,2,36,3],[37,0,47,0],[38,2,38,3],[39,2,39,3],[40,2,40,3],[41,2,41,3],[42,2,42,3],[43,2,43,3],[44,2,44,3],[46,2,46,3],[47,2,47,3],[49,2,49,3],[52,1,52,2],[54,2,54,3]]}
[null,"Partner adatok"]
[]
["Engedélyes","Partnerkód: (ha ismert)",null,"Kérem válasszon!"]
[null,"Neve"]
[null,{"$f":"IF(D3=\"Természetes személy\",\"Állandó lakcím:\",\"Székhely címe:\")","v":"Székhely címe:"}]
[null,"Levélcíme"]
[null,"Értesítési címe"]
[null,"Értesítési levélcíme"]
[null,"Bankszámlaszám:"]
[null,"Frekvenciam díjkedvezmény ok","Nem vagyok jogosult"]
[null,{"$f":"IF($D3=\"Természetes személy\",\"Adóazonosító jele:\",\"Adószáma:\")","v":"Adószáma:"}]
[null,"Születéskori név:"]
[null,"Anyja neve"]
[null,"Születés ideje"]
[null,"Születés országa"]
[null,"Születés helye"]
["Díjfizető","A díjfizető:","Kérem válasszon!"]
[null,"Partnerkód: (ha ismert)",{"$f":"IF(OR($C$17=\"Másik személy\",$C$17=\"Kérem válasszon!\"),\"\",C3)","v":""},{"$f":"IF(OR($C$17=\"Másik személy\",$C$17=\"Kérem válasszon!\"),\"Kérem válasszon!\",D3)","v":"Kérem válasszon!"}]
[null,"Neve",""]
[null,{"$f":"IF(D18=\"Természetes személy\",\"Állandó lakcím:\",\"Székhely címe:\")","v":"Székhely címe:"},""]
[null,"Levélcíme",""]
[null,"Értesítési címe",""]
[null,"Értesítési levélcíme",""]
[null,"Bankszámlaszám:",""]
[null,{"$f":"IF(D18=\"Természetes személy\",\"Adóazonosító jele:\",\"Adószáma:\")","v":"Adószáma:"},{"$f":"IF(OR($C$17=\"Másik személy\",$C$17=\"Kérem válasszon!\"),\"\",C11)","v":""}]
[null,"Születéskori név:",{"$f":"IF(OR($C$17=\"Másik személy\",$C$17=\"Kérem válasszon!\"),\"\",C13)","v":""}]
[null,"Anyja neve"]
[null,"Születés ideje"]
[null,"Születés országa",{"$f":"IF(OR($C$17=\"Másik személy\",$C$17=\"Kérem válasszon!\"),\"\",C15)","v":""}]
[null,"Születés helye",{"$f":"IF(OR($C$17=\"Másik személy\",$C$17=\"Kérem válasszon!\"),\"\",C16)","v":""}]
{"$rows_left_out":28}
{"sheet":"Jármű vagy telephely adatok","index":1,"n_rows":37,"n_cols":11,"rows_kept":37,"merged":[[0,2,0,4],[0,5,0,8],[0,9,0,10],[1,6,1,8],[2,6,2,8],[3,6,3,8],[4,6,4,8],[5,6,5,8],[6,6,6,8],[7,6,7,8],[8,6,8,8],[9,6,9,8],[10,6,10,8],[11,6,11,8],[12,6,12,8],[13,6,13,8],[14,6,14,8],[15,6,15,8],[16,6,16,8],[17,6,17,8],[18,6,18,8],[19,6,19,8],[20,6,20,8],[21,6,21,8],[22,6,22,8],[23,6,23,8],[24,6,24,8],[25,6,25,8],[26,6,26,8],[27,0,28,0],[27,2,28,2],[27,3,27,5],[27,7,27,8],[27,9,27,10],[28,3,28,4],[29,3,29,4],[30,3,30,4],[31,3,31,4],[32,3,32,4],[33,3,33,4],[34,0,34,1],[34,2,34,7],[36,1,36,2],[36,3,36,4]]}
[null,"Engedélyes neve:",{"$f":"IF('Partner adatok'!C4=\"\",\"\",'Partner adatok'!C4)","v":""},null,null,"Többségi, vagy kijelölt tulajdonos",{"$nulls":3},"Az évi időszakos üzemeltetés időszaka"]
["No","Hívójel","A változás","A jármű típusa","Lajstrom jele","Neve","Címe:",null,null,"Kezdete","Vége"]
[1,"Hívójel","Kérem válassza ki!"]
[2,"Hívójel","Kérem válassza ki!"]
[3,"Hívójel","Kérem válassza ki!"]
[4,"Hívójel","Kérem válassza ki!"]
[5,"Hívójel","Kérem válassza ki!"]
[6,"Hívójel","Kérem válassza ki!"]
[7,"Hívójel","Kérem válassza ki!"]
[8,"Hívójel","Kérem válassza ki!"]
[9,"Hívójel","Kérem válassza ki!"]
[10,"Hívójel","Kérem válassza ki!"]
[11,"Hívójel","Kérem válassza ki!"]
[12,"Hívójel","Kérem válassza ki!"]
[13,"Hívójel","Kérem válassza ki!"]
[14,"Hívójel","Kérem válassza ki!"]
[15,"Hívójel","Kérem válassza ki!"]
[16,"Hívójel","Kérem válassza ki!"]
[17,"Hívójel","Kérem válassza ki!"]
[18,"Hívójel","Kérem válassza ki!"]
[19,"Hívójel","Kérem válassza ki!"]
[20,"Hívójel","Kérem válassza ki!"]
[21,"Hívójel","Kérem válassza ki!"]
[22,"Hívójel","Kérem válassza ki!"]
[23,"Hívójel","Kérem válassza ki!"]
[24,"Hívójel","Kérem válassza ki!"]
[25,"Hívójel","Kérem válassza ki!"]
["Fix állomás",null,"Változás","Címe",null,null,"Tengerszint\nfeletti","Koordináták",null,"Az évi időszakos üzemeltetés időszaka"]
[null,"Állomásnév",null,"Helység",null,"közterület név, házszám","magasság\n (m)","EOV y","EOVx","Kezdete","Vége"]
[1,"Állomásnév","Kérem válassza ki!"]
{"$rows_left_out":8}
{"sheet":"Berendezés adatok","index":2,"n_rows":137,"n_cols":38,"rows_kept":137,"merged":[[1,2,1,7],[1,27,1,37],[2,27,3,27],[2,28,2,35],[2,36,2,37],[135,0,135,1],[135,2,135,13],[136,2,136,3]]}
[]
[null,"Engedélyes",{"$f":"IF('Partner adatok'!C4<>0,'Partner adatok'!C4,\"\")","v":""},{"$nulls":24},"Földi állandóhelyű állomás sugárzási jellemzői"]
[{"$nulls":27},"Hívónév","Atnenna",{"$nulls":7},"Napi üzemidő"]
["No","Hívójel\nvagy\nÁllomás név","Változás","Állomás \nosztály","Jellege","Üzembe \nhelyzés\n ideje","Rádióberendezés\nTípus","Gyártó","TSO vagy ETSO szám:","Használat \nmódja","Kategória","Rendeltetés","Névleges\nTeljesít-\nménye\n(W)","Engedélyezendő\nfrekvenciasáv","Adásmód","TX_1\n(MHz)","Adásmód_1","Rx_1\n(MHz)","TX_2\n(MHz)","Adásmód_2","Rx_2\n(MHz)","Tx_3\n(MHz)","Adásmód_3","Rx_3\n(MHz)","TX_4\n(MHz)","Adásmód_4","Rx_4\n(MHz)",null,"típus","Gyártó","Fh\n(m)","G\n(dB)","Irány\n(o)","ERP \n(W)","ERP\n(dBW)","Ellátási\nsugár\nkm","kezd","vége"]
[1,null,{"$f":"IF(OR(B5=\"Hívójel\",B5=\"Hívónév\",B5=\"\"),\"\",\"Kérem válassza ki!\")","v":""},{"$f":"IF(OR(B5=\"Hívójel\",B5=\"Hívónév\",B5=\"\"),\"\",IF(LEFT(B5,2)=\"HA\",\"MA\",\"FA\"))","v":""},{"$f":"IF(OR(B5=\"Hívójel\",B5=\"Hívónév\",B5=\"\"),\"\",\"Üzemelő\")","v":""},null,null,{"$f":"IFERROR(IF(G5=\"\",\"\",IF(VLOOKUP($G5,Berendezések1,2,FALSE)=0,\"\",VLOOKUP($G5,Berendezések1,2,FALSE))),\"\")","v":""},{"$f":"IFERROR(IF(G5<>\"\",VLOOKUP($G5,Berendezések1,3,FALSE),\"\"),\"\")","v":""},{"$f":"IFERROR(IF(AND(G5<>\"\",OR(I5=\"*\",I5=\"\")),\"Kérem válasszon!\",IF(G5<>\"\",VLOOKUP($G5,Berendezések1,11,FALSE),\"\")),\"\")","v":""},{"$f":"IFERROR(IF(G5<>\"\",VLOOKUP($G5,Berendezések1,10,FALSE),\"\"),\"\")","v":""},{"$f":"IFERROR(IF(G5=\"\",\"\",VLOOKUP($G5,Berendezések1,9,FALSE)),\"Kérem válassza ki!\")","v":""},{"$f":"IFERROR(IF(G5<>\"\",VLOOKUP($G5,Berendezések1,7,FALSE),\"\"),\"\")","v":""},{"$f":"IFERROR(IF(G5<>\"\",IF(VLOOKUP($G5,Berendezések1,4,FALSE)<>0,VLOOKUP($G5,Berendezések1,4,FALSE),\"\"),\"\"),\"\")","v":""},{"$f":"IFERROR(IF(G5<>\"\",IF(AND(VLOOKUP($G5,Berendezések1,8,FALSE)<>0,VLOOKUP($G5,Berendezések1,4,FALSE)<>0),VLOOKUP($G5,Berendezések1,8,FALSE),\"\"),\"\"),\"\")","v":""},{"$f":"IFERROR(IF(G5=\"\",\"\",IF(VLOOKUP($G5,Berendezések1,5,FALSE)=0,\"\",VLOOKUP($G5,Berendezések1,5,FALSE))),\"\")","v":""},{"$f":"IFERROR(IF(G5<>\"\",IF(AND(VLOOKUP($G5,Berendezések1,5,FALSE)<>0,VLOOKUP($G5,Berendezések1,8,FALSE)<>0),VLOOKUP($G5,Berendezések1,8,FALSE),\"\"),\"\"),\"\")","v":""},{"$f":"IFERROR(IF(G5<>\"\",IF(VLOOKUP($G5,Berendezések1,6,FALSE)<>0,VLOOKUP($G5,Berendezések1,6,FALSE),\"\"),\"\"),\"\")","v":""},{"$f":"IFERROR(IF(G5=\"\",\"\",IF(VLOOKUP($G5,Berendezések1,12,FALSE)=0,\"\",VLOOKUP($G5,Berendezések1,12,FALSE))),\"\")","v":""},{"$f":"IFERROR(IF(G5=\"\",\"\",IF(VLOOKUP($G5,Berendezések1,13,FALSE)=0,\"\",VLOOKUP($G5,Berendezések1,13,FALSE))),\"\")","v":""},null,{"$f":"IFERROR(IF(G5=\"\",\"\",IF(VLOOKUP($G5,Berendezések1,14,FALSE)=0,\"\",VLOOKUP($G5,Berendezések1,14,FALSE))),\"\")","v":""},{"$f":"IFERROR(IF(G5=\"\",\"\",IF(VLOOKUP($G5,Berendezések1,15,FALSE)=0,\"\",VLOOKUP($G5,Berendezések1,15,FALSE))),\"\")","v":""},{"$nulls":10},{"$f":"IF(AI5<>\"\",POWER(10,AI5/10),\"\")","v":""},{"$f":"IF(AND(M5<>\"\",AF5<>\"\"),AF5+10*LOG10(M5),\"\")","v":""}]
[2,null,"",{"$f":"IF(OR(B6=\"Hívójel\",B6=\"Hívónév\",B6=\"\"),\"\",IF(LEFT(B6,2)=\"HA\",\"MA\",\"FA\"))","v":""},{"$f":"IF(OR(B6=\"Hívójel\",B6=\"Hívónév\",B6=\"\"),\"\",\"Üzemelő\")","v":""},null,null,{"$f":"IFERROR(IF(G6=\"\",\"\",IF(VLOOKUP($G6,Berendezések1,2,FALSE)=0,\"\",VLOOKUP($G6,Berendezések1,2,FALSE))),\"\")","v":""},{"$f":"IFERROR(IF(G6<>\"\",VLOOKUP($G6,Berendezések1,3,FALSE),\"\"),\"\")","v":""},"","",{"$f":"IFERROR(IF(G6<>\"\",VLOOKUP($G6,Berendezések1,9,FALSE),\"\"),\"\")","v":""},"",{"$f":"IFERROR(IF(G6<>\"\",IF(VLOOKUP($G6,Berendezések1,4,FALSE)<>0,VLOOKUP($G6,Berendezések1,4,FALSE),\"\"),\"\"),\"\")","v":""},"","","","","","",null,"","",{"$nulls":10},{"$f":"IF(AI6<>\"\",POWER(10,AI6/10),\"\")","v":""},""]
[3,null,"","","",null,null,"","","","","","","","","","","","","",null,"","",{"$nulls":10},"",""]
[4,null,null,"","",null,null,"","","","","","","","","","","","","",null,"","",{"$nulls":10},"",""]
[5,null,"","","",null,null,"","","","","","","","","","","","","",null,"","",{"$nulls":10},"",""]
[6,null,"","","",null,null,"","","","","","","","","","","","","",null,"","",{"$nulls":10},"",""]
[7,null,"","","",null,null,"","","","","","","","","","","","","",null,"","",{"$nulls":10},"",""]
[8,null,"","","",null,null,"","","","","","","","","","","","","",null,"","",{"$nulls":10},"",""]
[9,null,"","","",null,null,"","","","","","","","","","","","","",null,"","",{"$nulls":10},"",""]
[10,null,"","","",null,null,"","","","","","","","","","","","","",null,"","",{"$nulls":10},"",""]
[11,null,"","","",null,null,"","","","","","","","","","","","","",null,"","",{"$nulls":10},"",""]
[12,null,"","","",null,null,"","","","","","","","","","","","","",null,"","",{"$nulls":10},"",""]
[13,null,"","","",null,null,"","","","","","","","","","","","","",null,"","",{"$nulls":10},"",""]
[14,null,"","","",null,null,"","","","","","","","","","","","","",null,"","",{"$nulls":10},"",""]
[15,null,"","","",null,null,"","","","","","","","","","","","","",null,"","",{"$nulls":10},"",""]
[16,null,"","","",null,null,"","","","","","","","","","","","","",null,"","",{"$nulls":10},"",""]
[17,null,"","","",null,null,"","","","","","","","","","","","","",null,"","",{"$nulls":10},"",""]
[18,null,"","","",null,null,"","","","","","","","","","","","","",null,"","",{"$nulls":10},"",""]
[19,null,"","","",null,null,"","","","","","","","","","","","","",null,"","",{"$nulls":10},"",""]
[20,null,"","","",null,null,"","","","","","","","","","","","","",null,"","",{"$nulls":10},"",""]
[21,null,"","","",null,null,"","","","","","","","","","","","","",null,"","",{"$nulls":10},"",""]
[22,null,"","","",null,null,"","","","","","","","","","","","","",null,"","",{"$nulls":10},"",""]
[23,null,"","","",null,null,"","","","","","","","","","","","","",null,"","",{"$nulls":10},"",""]
[24,null,"","","",null,null,"","","","","","","","","","","","","",null,"","",{"$nulls":10},"",""]
[25,null,"","","",null,null,"","","","","","","","","","","","","",null,"","",{"$nulls":10},"",""]
[26,null,"","","",null,null,"","","","","","","","","","","","","",null,"","",{"$nulls":10},"",""]
{"$rows_left_out":108}
{"sheet":"Listák","index":3,"n_rows":130,"n_cols":13,"rows_kept":130,"hidden":true}
["Kagória",{"$nulls":4},"Sávok","Alkalmazás",{"$nulls":5},"Gyártók"]
["Kérem válassza ki!",null,"Kérem válassza ki!","Kérem válassza ki!",null,"108 MHz - 118 MHz","VOR",{"$nulls":5},"ACK"]
["Adó-vevő",null,"Kommunikáció","Adó-vevő",null,"118 MHz - 137 MHz","COM1",null,"Kategória",{"$nulls":3},"ACR"]
["Mentőeszköz",null,"DME távolságmérő","Egyéb berendezés",null,"2 MHz - 29,9 MHz","COM2",{"$nulls":5},"ACR/ARTEX"]
["Vészjelző",null,"Légijármű-fedélzeti légtérellenőrző radar","Egyéb berendezés",null,"255 kHz - 526,5 kHz","NDB útvonal irányadó föld-levegő",{"$nulls":5},"ACSS"]
["Egyéb berendezés",null,"Légijármű-fedélzeti meteorológiai radar","Egyéb berendezés",null,"255 kHz - 1799 kHz",{"$nulls":6},"AIR PRECISION"]
[null,null,"EPIRB vészjeladó","Vészjelző",null,"329,150 MHz - 335 MHz ","siklópálya",{"$nulls":5},"AIRPLUS"]
[null,null,"ACARS Unilink","Egyéb berendezés",null,"960 MHz - 1215 MHz","DME",{"$nulls":5},"ARTEX"]
["Telepítés",null,"ACAS/TCAS rendszer","Egyéb berendezés",null,"1215 MHz - 1240 MHz","földi légtér ell. Radar",{"$nulls":5},"ASTRONICS"]
["Kérem válasszon!",null,"Doppler rendszerű navigációs segéd berendezés","Egyéb berendezés",null,"1559 MHz - 1626,5 MHz",{"$nulls":6},"AVIDYNE"]
["Beépített",null,"Fedélzeti radar érzékelő és mérő rendszer","Egyéb berendezés",{"$nulls":8},"AVIDYNE/RYAN"]
["Mobil",null,"Gurító radar","Egyéb berendezés",{"$nulls":8},"BAKLAN"]
["Kézi rádió",null,"Időjárás radar","Egyéb berendezés",{"$nulls":8},"BECKER"]
[null,null,"ILS siklópálya adó","Egyéb berendezés",{"$nulls":8},"BENDIX"]
[null,null,"Kutatás-mentés","Mentő eszköz",{"$nulls":8},"BENDIXKING"]
[null,null,"Légi navigáció célú eszköz","Egyéb berendezés",{"$nulls":8},"BENDIXKING - HONEYWELL"]
[null,null,"Légi navigáció célú rendszer","Egyéb berendezés",{"$nulls":8},"CEIS TM"]
[null,null,"Légijármű-fedélzeti Doppler radar","Egyéb berendezés",null,"Adásmód","Alkalmazás",{"$nulls":5},"CESSNA ARC"]
[null,null,"Légtér ellenőrző radar","Egyéb berendezés",null,"16K0G1D","ELT 406.025",{"$nulls":5},"COBHAM"]
["Változás3",null,"Loran-A rádiónavigációs rendszer","Egyéb berendezés",null,"3K20A3X","ELT 243",{"$nulls":5},"COLLINS"]
["Kérem válassza ki!",null,"Magasságmérő radar","Egyéb berendezés",null,"6K00A3EJN","VHF Kommunikáció",{"$nulls":5},"DITTEL"]
["Új berendezés",null,"Mentési célra szolgáló eszköz, vészjeladó","Vészjelző",null,"200KV1DAN","TCAS rendszer",{"$nulls":5},"DITTEL AVIONIK"]
["Adatváltozás",null,"MLS rendszer","Egyéb berendezés",null,"1M00F3XXN","Magasságmérő radar",{"$nulls":5},"DORNE & MARGOLIN"]
["Berendezés Csere",null,"Navigációs feladatokat ellátó és támogató rendszer","Egyéb berendezés",null,"3M00P0NAN","Fedélzeti meteorológiai radar",{"$nulls":5},"DYNON AVIONICS"]
["Berendezés törlés",null,"NDB Útvonal irányadó","Egyéb berendezés",null,"794KP0NAN","DME távolságmérő",{"$nulls":5},"ELEKTROSIGNAL ZAO"]
[null,null,"PLB Pesonal Location Beacon","Vészjelző",null,"12M0M1D","Válasz jeladó",{"$nulls":5},"ELTA"]
[null,null,"Precíziós megközelítő rendszer","Egyéb berendezés",null,"20K9A9WWF","VOR Közelkörzeti rádióirányadó rendszer",{"$nulls":5},"F.U.N.K.E. AVIONICS GMBH"]
[null,null,"Radar","Egyéb berendezés",null,"2K15J3EJN","RH Kommunikáció",{"$nulls":5},"FILSER ELECTRONIC GMBH"]
["Változás2",null,"Radarbója","Egyéb berendezés",{"$nulls":8},"FUNKWERK AVIONICS"]
["Kérem válassza ki",null,"SRE","Egyéb berendezés",{"$nulls":8},"GARMIN"]
{"$rows_left_out":101}
{"sheet":"Kitöltési útmutató","index":4,"n_rows":62,"n_cols":4,"rows_kept":62,"merged":[[0,1,0,2],[1,1,14,1],[15,1,22,1],[23,1,29,1],[30,1,35,1],[36,1,50,1],[61,1,61,2]]}
[null,"A táblázatok kezelése  ",null,"A táblázatokban csak az adatmezőkbe lehet írni, a többi cella szerkesztése nem megengedett. \nA táblázat egyes cellái beírt Excel képleteket, függvényeket tartalmaznak, amelyek az adatszolgltatás teljesítését segítik. Amennyiben egy ilyen cellába új értéket viszünk be, ezzel a képlet kitörlésre került a cellából.\nA \"Jármű vagy telephely adatok\" és a \"Berendezés adatok\" táblázatokban a felesleges sorok kitörölhetőek vagy elrejthetőek, illetve lehetséges a táblázatokba további sorok beszúrása.  A beszúrt sorokba egy még nem szerkesztett sorból az elrejtett képletek átmásolhatóak. A cella sárga háttérszíne a mező kötelező kitöltését jelzi, míg a piros háttér szín valószínűsíthetően hibás adatra hívja fel a figyelmet.\nHa letöltött táblázatot a Sablon könyvtárba mentettük el, akkor mint Új táblázatot megnyitva egy kitöltetlen táblázattal kezdhetünk dolgozni. \nA kitöltött táblázat - akár Új Táblazatként, akár korábban mentett fájlból került megnyitásra, a kitöltő által elérhető mappába kimenthető.\n\nA táblázatok makrókat nem tartalmaznak."]
[null,"Partner","Partnerkód: (ha ismert)","A berendezés jellege lehet Üzemelő vagy tartalék berendezés, amely értéket legördülő mezőből lehet kiválasztani. Más érték nem adható meg. Tartalék állomások után nem kerül frekvenciahasználati díj megállapításra."]
[null,null,"Neve","A jogi partner cégbíróság bejegyzés, a természetes személy anyakönyvezés szerinti neve"]
[null,null,"Székhely, vagy állandó lakcíme","Jogi partner székhely címe, természetes személy állandólekhely címe (Pl.: 1012 Budapest, Ostrom utca 23-25.)"]
[null,null,"Levélcíme","Jogi partner székhely címének levelezési címe, természetes személy állandólekhely címének levelezési címe. (Pl.: 1525 Budapest, Pf.: 75.)"]
[null,null,"Értesítési címe","A partner értesítési közigazgatási címe. (Pl.: 1133 Budapest, Visegrádi utca 106.)"]
[null,null,"Értesítési levélcíme","A partner értesítési címének levelezési címe. (Pl.: 1376 Budapest, Pf.: 997.)"]
[null,null,"Bankszámlaszám:","Annak a bankszámlának a száma, amelyről a frekvenciadíjat fogják fizetni."]
[null,null,"Díjkedvezmény","A frekvenciadíj kedvezményre való jogosultság okát lehet kiválasztani a legördülő értékekből."]
[null,null,{"$f":"IF($D2=\"Természetes személy\",\"Adóazonosító jele:\",\"Adószáma:\")","v":"Adószáma:"},"Jogi személy adószáma"]
[null,null,"Adóazonosító jele","Természetes személy adó azonosító jele."]
[null,null,"Anyja neve","Természetes személy anyja születés kori neve"]
[null,null,"Születés ideje","Természetes személy születési ideje éééé.hh.nn forátumban"]
[null,null,"Születés országa","Természetes személy születési helyének országa - ha az nem Magyarország."]
[null,null,"Születés helye","Természetes személy születési helye"]
[null,"A kérelem","Ügyintéző neve","A kérelmet benyújtó jogi személy ügyintézőjének neve."]
[null,null,"Telefonja","A kérelmet benyújtó jogi személy ügyintézőjének telefonszáma."]
[null,null,"E-mail címe","A kérelmet benyújtó jogi személy ügyintézőjének E-mail címe."]
[null,null,"Kérelem azonosítója","A kérelmet azonosító adat, amely a kérelmet a benyújtó számára azonosítja."]
[null,null,"Eljárási megbízás","Eljárási megbízás eredeti példányát kell az esetbe csatolni a kérelemhez, amennyiben a kérelmet nem az engedélyes nyújtja be."]
[null,null,"Kérelemmel érintett hívójelek","Az ügyintézést segítő összesítés, amelyet a kérelmezőnek nem kell töltenie. A mező a Jármű vagy telephely adatok lapon megadott adatokból töltődik fel."]
[null,null,"Nyilatkozat","A kiadott rádióengedély véglegessé válásával lesz jogszerű a frekvenciahasználat, ezért a kiadott rádióengedélyeket véglegesíteni kell. A kérelem benyújtója nyilatkozhat, hogy lemond-e fellebbezési jogáról helyt adó határozat esetében. Lemodás esetán a határozat átvételének másnapján, ennek hiányában csak a fellebbezésre nyitva álló idő letelte után válik véglegessé a rádióengedély."]
[null,null,"Megjegyzés:","Kérelmező által szabadon tölthető mező, valamely- a rádióengedély kiadás szempontjából fontos körülmény megadására."]
[null,"A jármű","Hívójel","Itt kell megadni a jármű hívójelét, a mezőben előre berirt \"Hívójel\" érték felülírásával"]
[null,null,"A változás","A változás kód megadásával jelezhető, hogy az új járművet-, egy korábbi már engedélyben szereplő jármű adatait módosítani vagy törölni szeretnénk, illetve a járműbe szerelt állomásokban történt változás, és a jármű azonosítát szolgálja ez az adatsor."]
[null,null,"A jármű típusa","A jármű azonosítását segítő jármű típusát kell megadni."]
[null,null,"Lajstrom jele","A jármű lajstrom jelét kell megadni."]
[null,null,"Többségi, vagy kijelölt tulajdonos neve","Többségi, vagy kijelölt tulajdonos neve"]
[null,null,"Többségi, vagy kijelölt tulajdonos címe","Többségi, vagy kijelölt tulajdonos címe"]
[null,null,"Az évi időszakos üzemeltetés időszaka","Amennyiben az állomás nem folyamatos üzemeltetésű, akkor megadható az üzemeltetés időszaka. Az időszakot úgy kell hh.nn formátumban megadni, hogy évente legalább egybefüggően 92 napot kell üzemelő állapotúnak lennie."]
{"$rows_left_out":33}
{"sheet":"Eq_par","index":5,"n_rows":223,"n_cols":17,"rows_kept":223,"hidden":true}
["Sr","Típus","GYÁRTÓ","ETSO szám","adó frekvencia\n(sáv)","adó fixfrekvencia\nMHz","Vevőfrekvencia\nMHz","Teljesítmény\nW","Gyári Adásmódok","Vészjeladó","Kategória","Telepítés","Tx1","Ad1","Tx2","Ad2","Megjegyzés"]
[1,"300SL","PRIMUS","TSO-C63A",null,"9375",9375,null,"3M00P0NAN","Légijármű-fedélzeti meteorológiai radar","Egyéb berendezés","Beépített"]
[2,"406 AF","HONEYWELL","EASA.IM.21O.706",null,406.025,null,"0,1/0,1/5","16KOG1D","Vészjeladó","Vészjelző","Mobil",243,"3K20A3X",121.5,"3K20A3X"]
[3,"406 AF(6D)","KANNAD","EASA.21O.1097, REV. B",null,406.025,null,"0,1/0,1/5","16KOG1D","Vészjeladó","Vészjelző","Mobil",243,"3K20A3X",121.5,"3K20A3X"]
[4,"406 AF-Compact","KANNAD","EASA.21O.818, REV. B",null,406.028,null,"5/0,4","16KOG1D","Vészjeladó","Vészjelző","Mobil",243,"3K20A3X",121.5,"3K20A3X"]
[5,"406 AF-H","KANNAD","EASA.21O.1098, REV. A",null,406.025,null,"5/0,1/0,1","16KOG1D","Vészjeladó","Vészjelző","Mobil",243,"3K20A3X",121.5,"3K20A3X"]
[6,"406 AP","KANNAD","EASA.21O.1098, REV. A",null,406.025,null,"0,4/0,4/5","16KOG1D","Vészjeladó","Vészjelző","Mobil",243,"3K20A3X",121.5,"3K20A3X"]
[7,"500-12","TECHTEST LIMITED","TSO-C126",null,406.025,null,"0,1/0,1/5","16KOG1D","Vészjeladó","Vészjelző","Mobil",243,"3K20A3X",121.5,"3K20A3X"]
[8,"618M-5","ROCKWELL COLLINS","TSO-C37d","118 - 136,975 ",null,null,20,"6K00A3EJN","Kommunikáció","Adó-vevő","Beépített"]
[9,"628T-2A","COLLINS","TSO-C31","2-29,9",null,null,400,"A3H, A3J, A1, A7J, A9J","Kommunikáció","Adó-vevő","Beépített"]
[10,"860E5 DME","ROCKWELL COLLINS","*","960-1215 MHz",{"$nulls":3},"794KP0NAN","DME távolságmérő","Egyéb berendezés","Beépített"]
[11,"860F-4","ROCKWELL COLLINS","TSO-C87",{"$nulls":4},"1M00F3XXN","Magasságmérő radar","Egyéb berendezés","Beépített"]
[12,"91-001-220A","MCMURDO","*",null,406,null,"0,1/5","16KOG1D","Vészjeladó","Vészjelző","Mobil",121.5,"3K20A3X",121.5,"3K20A3X"]
[13,"9900BX","AVIDYNE/RYAN","*",null,1090,1030,null,"200KV1DAN","ACAS/TCAS rendszer","Egyéb berendezés","Beépített"]
[14,"A06","ELTA","F.O.089",null,406.028,null,"0,1/0,1/5","16KOG1D","Vészjeladó","Vészjelző","Mobil",243,"3K20A3X",121.5,"3K20A3X"]
[15,"A-06 AP","ELTA","F.O.033",null,406.025,null,"0,1/0,1/5","16KOG1D","Vészjeladó","Vészjelző","Mobil",243,"3K20A3X",121.5,"3K20A3X"]
[16,"A06T","ELTA","F.O.089",null,406.025,null,"0,1/0,1/5","16KOG1D","Vészjeladó","Vészjelző","Mobil",243,"3K20A3X",121.5,"3K20A3X"]
[17,"A-06V2","ELTA","F.O.037",null,406.025,null,"0,1/0,1/5","16KOG1D","Vészjeladó","Vészjelző","Mobil",243,"3K20A3X",121.5,"3K20A3X"]
[18,"ADT 406 S","ELTA","EASA.21O.624",null,406.028,null,"0,14/0,14/5","16KOG1D","Vészjeladó","Vészjelző","Mobil",243,"3K20A3X",121.5,"3K20A3X"]
[19,"ADT406 AF","ELTA","EASA.21O.624",null,406.028,null,"0,14/0,14/5","16KOG1D","Vészjeladó","Vészjelző","Mobil",243,"3K20A3X",121.5,"3K20A3X"]
[20,"ADT406 AF/AP-H ","ELTA","EASA.21O.624",null,406.028,null,"0,14/0,14/5","16KOG1D","Vészjeladó","Vészjelző","Mobil",243,"3K20A3X",121.5,"3K20A3X"]
[21,"ADT406 AP ","ELTA","EASA.21O.624",null,406.028,null,"0,14/0,14/5","16KOG1D","Vészjeladó","Vészjelző","Mobil",243,"3K20A3X",121.5,"3K20A3X"]
[22,"AHV1600","THALES","EASA.21O.1286, REV. C","4200 - 4400",null,"4200 - 4400","0,07","1M00F3XXN","Magasságmérő radar","Egyéb berendezés","Beépített"]
[23,"AK-451","AMERI-KING","TSO-C126",null,406.028,null,"0,1/0,1/5","16KOG1D","Vészjeladó","Vészjelző","Mobil",243,"3K20A3X",121.5,"3K20A3X"]
[24,"ALA-52B","HONEYWELL","EASA.IM.21O.10033125","4235 - 4365",null,null,"0,4","1M00F3XXN","Magasságmérő radar","Egyéb berendezés","Beépített"]
[25,"ALT-55B","ROCKWELL COLLINS","TSO-C87",null,4300,4300,"0,35","1M00F3XXN","Magasságmérő radar","Egyéb berendezés","Beépített"]
[26,"AO6V2 ELT ","CEIS TM","*",null,406.025,null,"0,1/0,1/5","16KOG1D","Vészjeladó","Vészjelző","Mobil",243,"3K20A3X",121.5,"3K20A3X"]
[27,"AR-4201","BECKER","LBA.O.10.911/87 JTSO","118 - 136,975 ",null,null,5,"6K00A3EJN","Kommunikáció","Adó-vevő","Beépített",{"$nulls":4},"2018 jan. 01. után nem lehet fedélzeti rádió"]
[28,"AR6201","BECKER","EASA.21O.1249, REV. A","118 - 136,975 ",null,null,">6","6K00A3EJN","Kommunikáció","Adó-vevő","Beépített"]
[29,"AR6203","BECKER","EASA.21O.10054849","118-137",{"$nulls":3},"6K00A3EJN","Kommunikáció","Adó-vevő","Beépített"]
{"$rows_left_out":193}